{"text_format":"1","workbook":"xlsx","n_sheets":3,"sheets":["Calculator","Selections","ML Table"],"not_rendered":{"charts":0,"images":3,"macros":1,"external_links":0,"defined_names":8,"comments":0,"pivot_tables":0},"unopened":[],"bounds":{"document_bytes":16777216,"sheet_cells":100000,"rows_first":2000,"rows_last":500,"rows_between":2000,"halvings":0,"cell_chars":16384,"cell_head_chars":4096},"cells_cut":0,"cells_raw":0,"read":"whole","date_system":"1900"}

{"sheet":"Calculator","index":0,"n_rows":22,"n_cols":6,"rows_kept":22,"cut":false,"hidden":false,"merged":[[0,1,0,5],[22,1,22,5]]}
[]
[]
[null,"Pick Your County",null,"Pick Your Subdivision",null,"Pick Your Parcel Type"]
[null,"Maricopa",null,"I don’t see my subdivision",null,"Residence, Common Area, Commercial Lot, or Category 1 ML"]
[]
[null,"Instructions for spreadsheet",null,"Your Water Provider is",null,"Your Active Management Area is"]
[null,null,null,{"$f":"VLOOKUP(Table7[Pick Your Subdivision], 'ML Table'!C2:E1264, 3, FALSE)","v":"Unknown"},null,{"$f":"(VLOOKUP(Table7[Pick Your Subdivision], 'ML Table'!C2:E1264, 2, FALSE))","v":"Unknown"}]
[]
[null,"Enter Your Water Use",null,"Pick the Units",null,"Pick the Duration"]
[null,80000,null,"Gallons",null,"Per Year"]
[]
[null,null,null,"You use:",null,"Per Acre-foot Charge of:"]
[null,null,null,{"$f":"CONCATENATE(TEXT((Table9[Enter Your Water Use]*VLOOKUP(Table11[Pick the Units], Selections!A11:B15, 2, FALSE)*VLOOKUP(Table13[Pick the Duration], Selections!A18:B19,2,FALSE)), \"###,###\"), \" gallons of water each year or \", TEXT(((1/325851)*Table9[Enter Your Water Use]*VLOOKUP(Table11[Pick the Units], Selections!A11:B15, 2, FALSE)*VLOOKUP(Table13[Pick the Duration], Selections!A18:B19,2,FALSE)), \"0.00\"), \" acre-feet\")","v":"80,000 gallons of water each year or 0.25 acre-feet"},null,{"$f":"VLOOKUP(F7, Selections!A22:D25, 3, FALSE)-IF(Table15[Pick Your Parcel Type]=\"Category 2 ML Golf Course\", (VLOOKUP(F7, Selections!A22:D25, 4, FALSE)), 0)","v":785}]
[null,null,null,"Help me estimate my water use"]
[]
[null,"CAGRD Annual Dues",null,{"$f":"VLOOKUP(VLOOKUP(Table7[Pick Your Subdivision], 'ML Table'!C2:E1264, 2, FALSE), Selections!A22:B25, 2, FALSE)","v":35.729999999999997}]
[null,"Replenishment Charge",null,{"$f":"((Table9[Enter Your Water Use]*VLOOKUP(Table11[Pick the Units], Selections!A11:B15, 2, FALSE)*VLOOKUP(Table13[Pick the Duration], Selections!A18:B19,2,FALSE))/325851)*F13","v":192.72612328947892}]
[null,null,null,"Tell me more about CAGRD fees"]
[]
[null,"Yearly Estimated Total",null,{"$f":"D17+D16","v":228.45612328947891}]
[null,"Monthly Equivalent",null,{"$f":"D20/12","v":19.038010274123241}]
[null,null,null,"Why is this different from my tax statement?"]

{"sheet":"Selections","index":1,"n_rows":29,"n_cols":4,"rows_kept":29,"cut":false,"hidden":true,"merged":[]}
[]
[]
[]
["County List"]
["Maricopa"]
["Pima"]
["Pinal"]
["Unknown"]
[]
["Units List","Multiplier"]
["Gallons",1]
["Units / CCF",748]
["Thousand Gallons",1000]
["Ten Thousand Gallons",10000]
["Acre-Feet",{"$f":"325851","v":325851}]
[]
["Time List","Mulitiplier"]
["Per Month",12]
["Per Year",1]
[]
["AMA","AMD","AF Rate","RR Charge"]
["Phoenix",30,765,103]
["Pinal",23.38,785,103]
["Tucson",35.729999999999997,785,103]
["Unknown",35.729999999999997,785,103]
[]
["Parcel Type"]
["Residence, Common Area, Commercial Lot, or Category 1 ML"]
["Category 2 ML Golf Course"]

{"sheet":"ML Table","index":2,"n_rows":1264,"n_cols":5,"rows_kept":1264,"cut":false,"hidden":true,"merged":[]}
["ML #","County","Member Land Name","AMA:","WPNameAndDiv"]
[0,"Maricopa","I don’t see my subdivision","Unknown","Unknown"]
[1066,"Maricopa","Abel Ranch (fka Talaverde Estates) Combined","Phoenix","EPCOR Water Arizona Inc. (Arizona-American Water) - Agua Fria"]
[553,"Maricopa","Acacia Crossing","Phoenix","City of Buckeye"]
[1293,"Maricopa","Acoma Court","Phoenix","EPCOR Water Arizona Inc. (Arizona-American Water) - Agua Fria"]
[196,"Maricopa","Adobe Estates","Phoenix","Arizona Water Company - Apache Junction"]
[723,"Maricopa","Adobe Meadows","Phoenix","Arizona Water Company - Apache Junction"]
[465,"Maricopa","Agua Fria Ranch together with Enclave off Olive","Phoenix","EPCOR Water Arizona Inc. (Arizona-American Water) - Sun City"]
[850,"Maricopa","Alexandra Pointe Rural Subdivision","Phoenix","Saguaro Acres Community Facilities District"]
[1444,"Maricopa","Allen Ranches","Phoenix","EPCOR Water Arizona Inc. (Arizona-American Water) - Agua Fria"]
[900,"Maricopa","Anderson Parc","Phoenix","City of Buckeye (Valencia) - Valencia"]
[1113,"Maricopa","Anthem at Sun Valley South Unit 1","Phoenix","City of Buckeye"]
[1056,"Maricopa","Anthem at Sun Valley South Units 3, 5, 7, 9, 11, 13, 15, & 17","Phoenix","City of Buckeye"]
[1057,"Maricopa","Anthem at Sun Valley South Units 4, 6, 8, 10, & 12 (w/ non CAT 2 Golf Course)","Phoenix","City of Buckeye"]
[899,"Maricopa","Apache Farms","Phoenix","City of Buckeye (Valencia) - Valencia"]
[191,"Maricopa","Apache Peak II (Joy Ranch)","Phoenix","Desert Hills Water Company"]
[397,"Maricopa","Apache Peak III","Phoenix","Desert Hills Water Company"]
[11,"Maricopa","Apache Peak Ranch","Phoenix","Desert Hills Water Company"]
[1367,"Maricopa","Appleby 7","Phoenix","Town of Queen Creek"]
[20,"Maricopa","Arizona Traditions I","Phoenix","EPCOR Water Arizona Inc. (Arizona-American Water) - Agua Fria"]
[61,"Maricopa","Arizona Traditions II & III (filed under ML# 0020)","Phoenix","EPCOR Water Arizona Inc. (Arizona-American Water) - Agua Fria"]
[45,"Maricopa","Arizona Traditions IV, V, VI, VII","Phoenix","EPCOR Water Arizona Inc. (Arizona-American Water) - Agua Fria"]
[584,"Maricopa","Arizona Traditions North Parcel XIV","Phoenix","EPCOR Water Arizona Inc. (Arizona-American Water) - Agua Fria"]
[462,"Maricopa","Arizona Traditions North Parcel XV","Phoenix","EPCOR Water Arizona Inc. (Arizona-American Water) - Agua Fria"]
[433,"Maricopa","Arizona Traditions North Parcel XVI","Phoenix","EPCOR Water Arizona Inc. (Arizona-American Water) - Agua Fria"]
[305,"Maricopa","Arizona Traditions North XII and Xlll","Phoenix","EPCOR Water Arizona Inc. (Arizona-American Water) - Agua Fria"]
[136,"Maricopa","Arizona Traditions Parcels VIII, IX and X","Phoenix","EPCOR Water Arizona Inc. (Arizona-American Water) - Agua Fria"]
[183,"Maricopa","Arizona Traditions XI","Phoenix","EPCOR Water Arizona Inc. (Arizona-American Water) - Agua Fria"]
[134,"Maricopa","Arroyo De La Reina","Phoenix","Town of Queen Creek"]
[1230,"Maricopa","Arroyo Seco North","Phoenix","Arizona Water Company - White Tanks"]
[1255,"Maricopa","Arroyo Seco South (Village III)","Phoenix","Arizona Water Company - White Tanks"]
[789,"Maricopa","Ash Creek Estates","Phoenix","Town of Queen Creek"]
[1330,"Maricopa","Austin Ranch East (Aka North Copper Canyon)","Phoenix","Liberty Utilities (Beardsley Water) Corp."]
[981,"Maricopa","Austin Ranch West, Parcels 1-6 (Aka North Copper Canyon)","Phoenix","Liberty Utilities (Beardsley Water) Corp."]
[1395,"Maricopa","Azure Canyon (Combined a portion Parcel IV of Russell Ranch #0368)","Phoenix","EPCOR Water Arizona Inc. (Arizona-American Water) - Agua Fria"]
[1136,"Maricopa","Barney 20","Phoenix","Town of Queen Creek"]
[1363,"Maricopa","Barney Farms","Phoenix","Town of Queen Creek"]
[223,"Maricopa","Bel Fleur","Phoenix","Liberty Utilities (Litchfield Park Water & Sewer) - Corp."]
[542,"Maricopa","Bell Pointe I","Phoenix","EPCOR Water Arizona Inc. (Arizona-American Water) - Agua Fria"]
[1133,"Maricopa","Bell Pointe II","Phoenix","EPCOR Water Arizona Inc. (Arizona-American Water) - Agua Fria"]
[186,"Maricopa","Bell West Ranch","Phoenix","EPCOR Water Arizona Inc. (Arizona-American Water) - Agua Fria"]
[867,"Maricopa","Bellero (Pegasus Estates)","Phoenix","Town of Queen Creek"]
[1429,"Maricopa","Bentridge","Phoenix","City of Buckeye"]
[424,"Maricopa","Bethany Estates","Phoenix","Valley Utilities Water Company, Inc."]
[372,"Maricopa","Blue Hills","Phoenix","City of Buckeye (Valencia) - Valencia"]
[371,"Maricopa","Blue Horizons Villages (recorded as  Blue Horizons Villages Parcels 1-4)","Phoenix","Arizona Water Company - White Tanks"]
[521,"Maricopa","Brekanwood Estates","Phoenix","Chandler Heights Citrus Irrigation District"]
[1461,"Maricopa","Bridle Creek","Phoenix","Town of Queen Creek"]
[916,"Maricopa","Bridle Ranch (Ranchos Legante)","Phoenix","Town of Queen Creek"]
[576,"Maricopa","Buckeye 320, Phase 1","Phoenix","City of Buckeye (Valencia) - Valencia"]
[296,"Maricopa","Buckeye Park","Phoenix","City of Buckeye (Valencia) - Valencia"]
[98,"Maricopa","Buckeye Ranch, Phase 1","Phoenix","Global Water - Greater Tonopah Water Company, Inc."]
[768,"Maricopa","Caballos Del Rio","Phoenix","Sunrise Water Co."]
[1268,"Maricopa","Cachet at Wigwam","Phoenix","Liberty Utilities (Litchfield Park Water & Sewer) - Corp."]
[177,"Maricopa","Camberley Place","Phoenix","Arizona Water Company - Apache Junction"]
[352,"Maricopa","Camelback Garden Farms","Phoenix","Arizona Water Company - White Tanks"]
[1069,"Maricopa","Camelback Place at Dysart","Phoenix","Liberty Utilities (Litchfield Park Water & Sewer) - Corp."]
[952,"Maricopa","Camelot Condominium","Phoenix","City of Buckeye"]
[901,"Maricopa","Camelot Homes at Palm Valley","Phoenix","Liberty Utilities (Litchfield Park Water & Sewer) - Corp."]
[1418,"Maricopa","Camino Crossing","Phoenix","EPCOR Water Arizona Inc. (Arizona-American Water) - Agua Fria"]
[802,"Maricopa","Camino Vista","Phoenix","City of Tolleson"]
[1071,"Maricopa","Campanos Estates","Phoenix","Sunrise Water Co."]
[254,"Maricopa","Cantera Gates","Phoenix","Rose Valley Water Company"]
[184,"Maricopa","Canyon Ridge West","Phoenix","EPCOR Water Arizona Inc. (Arizona-American Water) - Sun City"]
[582,"Maricopa","Canyon Ridge West Parcel 5","Phoenix","EPCOR Water Arizona Inc. (Arizona-American Water) - Sun City"]
[1261,"Maricopa","Canyon Views","Phoenix","EPCOR Water Arizona Inc. (Arizona-American Water) - Agua Fria"]
[587,"Maricopa","Capistrano North","Phoenix","Valley Utilities Water Company, Inc."]
[588,"Maricopa","Capistrano South","Phoenix","Valley Utilities Water Company, Inc."]
[619,"Maricopa","Casa de Sunrise","Phoenix","Sunrise Water Co."]
[1167,"Maricopa","Cave Creek Promenade, A Condominium","Phoenix","Town of Cave Creek"]
[1137,"Maricopa","Cave Creek Rancho Verde Del Rio (Rancho Verde Del Rio Condominium)","Phoenix","Town of Cave Creek"]
[1007,"Maricopa","Charleston Estates","Phoenix","Town of Queen Creek"]
[1249,"Maricopa","Church Farm","Phoenix","Town of Queen Creek (H2O, Inc.)"]
[1059,"Maricopa","Church Farm Acres","Phoenix","Town of Queen Creek (H2O, Inc.)"]
[876,"Maricopa","Cielo Grande at Desert Hills","Phoenix","Desert Hills Water Company"]
[336,"Maricopa","Cielo Noche (Egyptian Valley Phases 1 & 2)","Phoenix","Town of Queen Creek"]
[215,"Maricopa","Circle G at Queen Creek IV","Phoenix","Town of Queen Creek"]
[6,"Maricopa","Circle G at Queen Creek, Unit I","Phoenix","Town of Queen Creek"]
[39,"Maricopa","Circle G at Queen Creek, Unit II Lots 41-77","Phoenix","Town of Queen Creek"]
[74,"Maricopa","Circle G at Queen Creek, Unit II-A Lots 78-93","Phoenix","Town of Queen Creek"]
[141,"Maricopa","Circle G at Queen Creek, Unit III","Phoenix","Town of Queen Creek"]
[1196,"Maricopa","Citrus Acres","Phoenix","EPCOR Water Arizona Inc. (Arizona-American Water) - Agua Fria"]
[389,"Maricopa","Citrus Coves","Phoenix","Town of Queen Creek"]
[171,"Maricopa","Citrus Point","Phoenix","EPCOR Water Arizona Inc. (Arizona-American Water) - Sun City"]
[195,"Maricopa","Clearview Estates","Phoenix","Sunrise Water Co."]
[1124,"Maricopa","Cliffstone","Phoenix","Town of Queen Creek"]
[193,"Maricopa","Cloud Creek Ranch","Phoenix","Town of Queen Creek (H2O, Inc.)"]
[816,"Maricopa","Cloud Creek Ranch II","Phoenix","Town of Queen Creek (H2O, Inc.)"]
[583,"Maricopa","Coldwater Ranch","Phoenix","EPCOR Water Arizona Inc. (Arizona-American Water) - Agua Fria"]
[1099,"Maricopa","Coldwater Station Condominiums","Phoenix","Liberty Utilities (Litchfield Park Water & Sewer) - Corp."]
[472,"Maricopa","Colter Commons","Phoenix","Liberty Utilities (Litchfield Park Water & Sewer) - Corp."]
[948,"Maricopa","Copper Falls","Phoenix","City of Buckeye (Valencia) - Valencia"]
[869,"Maricopa","Corriente Condominiums","Phoenix","EPCOR Water Arizona Inc. (PV) - Paradise Valley"]
[700,"Maricopa","Cortessa Parcel 1","Phoenix","EPCOR Water Arizona Inc. (Arizona-American Water) - Agua Fria"]
[701,"Maricopa","Cortessa Parcel 10","Phoenix","EPCOR Water Arizona Inc. (Arizona-American Water) - Agua Fria"]
[699,"Maricopa","Cortessa Parcel 11","Phoenix","EPCOR Water Arizona Inc. (Arizona-American Water) - Agua Fria"]
[704,"Maricopa","Cortessa Parcel 16","Phoenix","EPCOR Water Arizona Inc. (Arizona-American Water) - Agua Fria"]
[703,"Maricopa","Cortessa Parcel 17","Phoenix","EPCOR Water Arizona Inc. (Arizona-American Water) - Agua Fria"]
[702,"Maricopa","Cortessa Parcel 18","Phoenix","EPCOR Water Arizona Inc. (Arizona-American Water) - Agua Fria"]
[697,"Maricopa","Cortessa Parcel 2","Phoenix","EPCOR Water Arizona Inc. (Arizona-American Water) - Agua Fria"]
[696,"Maricopa","Cortessa Parcel 3","Phoenix","EPCOR Water Arizona Inc. (Arizona-American Water) - Agua Fria"]
[695,"Maricopa","Cortessa Parcel 4","Phoenix","EPCOR Water Arizona Inc. (Arizona-American Water) - Agua Fria"]
[698,"Maricopa","Cortessa Parcel 5, 6, 9, 12, 13, 14, 15, 19, 21, 22","Phoenix","EPCOR Water Arizona Inc. (Arizona-American Water) - Agua Fria"]
[694,"Maricopa","Cortessa Parcel 7","Phoenix","EPCOR Water Arizona Inc. (Arizona-American Water) - Agua Fria"]
[693,"Maricopa","Cortessa Parcel 8","Phoenix","EPCOR Water Arizona Inc. (Arizona-American Water) - Agua Fria"]
[417,"Maricopa","Cortina","Phoenix","Town of Queen Creek"]
[934,"Maricopa","Cotton Meadows (A.K.A. Algodon)","Phoenix","City of Buckeye (Valencia) - Valencia"]
[848,"Maricopa","Cottonwood","Phoenix","City of Buckeye"]
[459,"Maricopa","Cottonwood Estates","Phoenix","EPCOR Water Arizona Inc. (Arizona-American Water) - Agua Fria"]
[303,"Maricopa","Country Park Estates","Phoenix","Town of Queen Creek"]
[940,"Maricopa","Coyote Ridge","Phoenix","City of Buckeye"]
[214,"Maricopa","Creek View Ranches","Phoenix","Town of Queen Creek"]
[646,"Maricopa","Crismon Heights","Phoenix","Town of Queen Creek"]
[640,"Maricopa","Crismon Meadows","Phoenix","Town of Queen Creek"]
[8,"Maricopa","Crismon Ranch Estates","Phoenix","Town of Queen Creek"]
[1284,"Maricopa","Crossriver Point","Phoenix","EPCOR Water Arizona Inc. (Arizona-American Water) - Agua Fria"]
[1340,"Maricopa","Crossriver Summit","Phoenix","EPCOR Water Arizona Inc. (Arizona-American Water) - Agua Fria"]
[622,"Maricopa","Crossriver Units 1-8","Phoenix","EPCOR Water Arizona Inc. (Arizona-American Water) - Agua Fria"]
[960,"Maricopa","Crystal Vista","Phoenix","City of Buckeye (Valencia) - Valencia"]
[54,"Maricopa","Dave Brown at West Point-Model Complex","Phoenix","EPCOR Water Arizona Inc. (Arizona-American Water) - Agua Fria"]
[32,"Maricopa","Deer Village","Phoenix","Rose Valley Water Company"]
[68,"Maricopa","Deer Village II","Phoenix","Rose Valley Water Company"]
[1204,"Maricopa","Desert Hills Ranch","Phoenix","Desert Hills Water Company"]
[958,"Maricopa","Desert Moon Estates","Phoenix","City of Buckeye (Valencia) - Valencia"]
[1376,"Maricopa","Diamond Court","Phoenix","Arizona Water Company - Apache Junction"]
[1158,"Maricopa","Dorada Estates (fka Vaquero Estates)","Phoenix","Town of Queen Creek"]
[650,"Maricopa","Dos Rios Unit One and Unit Two","Phoenix","EPCOR Water Arizona Inc. (Arizona-American Water) - Agua Fria"]
[373,"Maricopa","Dove Cove Estates","Phoenix","City of Buckeye (Valencia) - Valencia"]
[58,"Maricopa","Dove Valley Ranch Parcel 3","Phoenix","Rose Valley Water Company"]
[69,"Maricopa","Dove Valley Ranch Parcel 5","Phoenix","Rose Valley Water Company"]
[55,"Maricopa","Dove Valley Ranch Parcel 6","Phoenix","Rose Valley Water Company"]
[313,"Maricopa","Dreaming Summit Unit 1","Phoenix","Valley Utilities Water Company, Inc."]
[301,"Maricopa","Dreaming Summit Unit 2A Parcels 1, 2, 3","Phoenix","Liberty Utilities (Litchfield Park Water & Sewer) - Corp."]
[25,"Maricopa","Dreaming Summit Unit 2B","Phoenix","Liberty Utilities (Litchfield Park Water & Sewer) - Corp."]
[395,"Maricopa","Dreaming Summit Unit 3A Parcels 1-5; Unit 3B, Parcels 1-3","Phoenix","Liberty Utilities (Litchfield Park Water & Sewer) - Corp."]
[446,"Maricopa","Dysart Ranch","Phoenix","Valley Utilities Water Company, Inc."]
[642,"Maricopa","Dysart Village","Phoenix","Valley Utilities Water Company, Inc."]
[72,"Maricopa","Eagle Canyon","Phoenix","Sunrise Water Co."]
[924,"Maricopa","Eagle Ridge Estates","Phoenix","Sunrise Water Co."]
[1288,"Maricopa","Eastwood","Phoenix","Carefree Water Company"]
[279,"Maricopa","EDC Estates","Phoenix","Arizona Water Company - White Tanks"]
[1304,"Maricopa","El Mirage & Loop 303","Phoenix","EPCOR Water Arizona Inc. (Arizona-American Water) - Agua Fria"]
[936,"Maricopa","Elianto Village 1","Phoenix","City of Buckeye"]
[925,"Maricopa","Elianto Village 4","Phoenix","City of Buckeye"]
[877,"Maricopa","Ellsworth Ranch (FKA Circle G at Ellsworth Estates) AMENDED","Phoenix","Town of Queen Creek"]
[102,"Maricopa","Emans Estates","Phoenix","Town of Queen Creek"]
[964,"Maricopa","Emperor Estates IV","Phoenix","Town of Queen Creek"]
[460,"Maricopa","Emperor Estates Phase 1 and 2","Phoenix","Town of Queen Creek"]
[784,"Maricopa","Emperor Estates Phase 3","Phoenix","Town of Queen Creek"]
[1440,"Maricopa","Empire Pointe","Phoenix","Town of Queen Creek"]
[1366,"Maricopa","Encanta","Phoenix","City of Tolleson"]
[787,"Maricopa","Encantada Estates","Phoenix","City of Buckeye"]
[1317,"Maricopa","Enclave at Carefree","Phoenix","Carefree Water Company"]
[1170,"Maricopa","Estates at Carefree (FKA-Hawks Landing)","Phoenix","Carefree Water Company"]
[520,"Maricopa","Estates at Lakeside","Phoenix","Lake Pleasant Water Company"]
[3,"Maricopa","Estates North, Unit II","Phoenix","Desert Hills Water Company"]
[422,"Maricopa","Estrella Vista","Phoenix","Town of Queen Creek"]
[454,"Maricopa","Estrella Vista at Buckeye (Estrella Vista)","Phoenix","City of Buckeye (Valencia) - Valencia"]
[1316,"Maricopa","Falcon Ridge","Phoenix","Valley Utilities Water Company, Inc."]
[972,"Maricopa","Falcon View","Phoenix","Valley Utilities Water Company, Inc."]
[1292,"Maricopa","Falcon View II","Phoenix","Valley Utilities Water Company, Inc."]
[885,"Maricopa","Farallon","Phoenix","City of Buckeye"]
[913,"Maricopa","Festival Foothills","Phoenix","City of Buckeye"]
[1308,"Maricopa","Festival Foothills - Phase 3 - Unit 27, 29 & 31","Phoenix","City of Buckeye"]
[1199,"Maricopa","Festival Foothills Unit 25 (Phase 3)","Phoenix","City of Buckeye"]
[1180,"Maricopa","Festival Phase 1A","Phoenix","City of Buckeye"]
[1441,"Maricopa","Festival Ranch Planning Area 3 - PUP E Parcels 33, 35, 84 & 88","Phoenix","City of Buckeye"]
[1098,"Maricopa","Fireside at Sienna Hills (AMENDED)","Phoenix","EPCOR Water Arizona Inc. (Arizona-American Water) - Agua Fria"]
[805,"Maricopa","Fitzpatrick Ranch Unit I","Phoenix","EPCOR Water Arizona Inc. (Arizona-American Water) - Sun City West"]
[897,"Maricopa","Fitzpatrick Ranch Unit II","Phoenix","EPCOR Water Arizona Inc. (Arizona-American Water) - Sun City West"]
[1026,"Maricopa","Fitzpatrick Ranch Unit III","Phoenix","EPCOR Water Arizona Inc. (Arizona-American Water) - Sun City West"]
[1243,"Maricopa","Fulton Homes @ Queen Creek Station","Phoenix","Town of Queen Creek"]
[1455,"Maricopa","Fulton Homes at Prasada","Phoenix","EPCOR Water Arizona Inc. (Arizona-American Water) - Agua Fria"]
[1423,"Maricopa","Fulton Homes Enclave","Phoenix","Arizona Water Company - White Tanks"]
[1305,"Maricopa","Gateway Quarter (FKA Ellsworth and Germann - AMENDED)","Phoenix","Town of Queen Creek"]
[1412,"Maricopa","Glendale Ridge Estates","Phoenix","Valley Utilities Water Company, Inc."]
[1424,"Maricopa","Goodyear Civic Square Parcel  'A'  at Estrella Falls","Phoenix","Liberty Utilities (Litchfield Park Water & Sewer) - Corp."]
[1413,"Maricopa","Goodyear Civic Square Parcel B","Phoenix","Liberty Utilities (Litchfield Park Water & Sewer) - Corp."]
[1342,"Maricopa","Goodyear Planned Regional Center (GPRC) Parcel 12","Phoenix","Liberty Utilities (Litchfield Park Water & Sewer) - Corp."]
[501,"Maricopa","Goodyear Planned Regional Center Parcels 9, 10 & 11","Phoenix","Liberty Utilities (Litchfield Park Water & Sewer) - Corp."]
[975,"Maricopa","Granada Villas","Phoenix","Carefree Water Company"]
[228,"Maricopa","Granite Mountain Ranch","Phoenix","Global Water - Northern Scottsdale Water Company, Inc."]
[1265,"Maricopa","Granite Vista Phase 1A","Phoenix","EPCOR Water Arizona Inc. (Arizona-American Water) - Agua Fria"]
[1266,"Maricopa","Granite Vista Phase 1B","Phoenix","EPCOR Water Arizona Inc. (Arizona-American Water) - Agua Fria"]
[1273,"Maricopa","Granite Vista Phase 1C","Phoenix","EPCOR Water Arizona Inc. (Arizona-American Water) - Agua Fria"]
[1274,"Maricopa","Granite Vista Phase 1D","Phoenix","EPCOR Water Arizona Inc. (Arizona-American Water) - Agua Fria"]
[1321,"Maricopa","Granite Vista Phase 2E","Phoenix","EPCOR Water Arizona Inc. (Arizona-American Water) - Agua Fria"]
[1318,"Maricopa","Granite Vista Phase 2F","Phoenix","EPCOR Water Arizona Inc. (Arizona-American Water) - Agua Fria"]
[1326,"Maricopa","Granite Vista Phase 2G","Phoenix","EPCOR Water Arizona Inc. (Arizona-American Water) - Agua Fria"]
[1475,"Maricopa","Granite Vista Phase 2H","Phoenix","EPCOR Water Arizona Inc. (Arizona-American Water) - Agua Fria"]
[1476,"Maricopa","Granite Vista Phase 2I","Phoenix","EPCOR Water Arizona Inc. (Arizona-American Water) - Agua Fria"]
[1477,"Maricopa","Granite Vista Phase 2J","Phoenix","EPCOR Water Arizona Inc. (Arizona-American Water) - Agua Fria"]
[202,"Maricopa","Greenway Parc at Surprise Phase One and Two","Phoenix","EPCOR Water Arizona Inc. (Arizona-American Water) - Agua Fria"]
[220,"Maricopa","Greenway Parc at Surprise Three","Phoenix","EPCOR Water Arizona Inc. (Arizona-American Water) - Agua Fria"]
[335,"Maricopa","Greer Ranch","Phoenix","Desert Hills Water Company"]
[658,"Maricopa","Greer Ranch North","Phoenix","EPCOR Water Arizona Inc. (Arizona-American Water) - Agua Fria"]
[533,"Maricopa","Greer Ranch South","Phoenix","EPCOR Water Arizona Inc. (Arizona-American Water) - Agua Fria"]
[209,"Maricopa","H Bar H Estates","Phoenix","Chandler Heights Citrus Irrigation District"]
[798,"Maricopa","Happy Hollow Villas Condominium","Phoenix","Carefree Water Company"]
[333,"Maricopa","Happy Trails Resort No. 10","Phoenix","EPCOR Water Arizona Inc. (Arizona-American Water) - Agua Fria"]
{"$rows_left_out":1064}